{"text_format":"1","workbook":"xlsx","n_sheets":7,"sheets":["1) Kumulativní rozpočet","KR zdroj","KR výstup","2) Stanovení jednotkové podpory","SJP Pomocné hodnoty","3) Výsledný rozpočet do ISKP21+","VP pomocné hodnoty"],"not_rendered":{"charts":0,"images":6,"macros":1,"external_links":1,"defined_names":16,"comments":4,"pivot_tables":0},"unopened":[],"bounds":{"document_bytes":16777216,"sheet_cells":100000,"rows_first":2000,"rows_last":500,"rows_between":2000,"halvings":0,"cell_chars":16384,"cell_head_chars":4096},"cells_cut":0,"cells_raw":0,"read":"whole","date_system":"1900"}

{"sheet":"1) Kumulativní rozpočet","index":0,"n_rows":67,"n_cols":10,"rows_kept":67,"cut":false,"hidden":false,"merged":[[7,8,7,9],[15,1,18,1],[21,3,21,6],[23,3,23,7],[28,6,33,8],[1,1,1,4],[2,3,2,5],[4,2,4,5],[4,8,4,9],[5,2,5,5],[5,8,5,9]]}
[]
[null,"Kumulativní rozpočet projektu"]
[null,null,"Editujte pouze zelená pole nebo použijte výběrová tlačítka","Důležité informace jsou označeny v komentáři u daných buněk."]
[]
[null,"Název žadatele:"]
[null,"Název projektu:"]
[]
[null,"Specifický cíl:"]
[null,"Opatření specifického cíle:",null,null,null,null," více Opatření na projektu?",{"$f":"IF('KR zdroj'!B56=TRUE,\"Vyberte všechna Opatření projektu na řádcích 52 a níže\",IF(AND('KR zdroj'!B56=FALSE,'KR zdroj'!Q63>0),\"Pozor na řádku 52 a níže vybráno více Opatření, které ale není v buňce G9 zaškrtnuto\",\"\"))","v":""}]
[null,"Aktivita (je-li relevantní):",null,null,null,null," více Aktivit na projektu?",{"$f":"IF('KR zdroj'!B57=TRUE,\"Vyberte všechny Aktivity projektu na řádcích 65 a níže\",IF(AND('KR zdroj'!B57=FALSE,'KR zdroj'!Q69>0),\"Pozor na řádku 65 a níže vybráno více Aktivit, které ale nejsou v buňce G10 zaškrtnuté\",\"\"))","v":""}]
[null,"Podaktivita (je-li relevantní)",null,null,null,null," více Podaktivit na projektu?",{"$f":"IF('KR zdroj'!B58=TRUE,\"Vyberte všechny Podopatření projektu na řádcích 72 a níže\",IF(AND('KR zdroj'!B58=FALSE,'KR zdroj'!Q74>0),\"Pozor na řádku 72 a níže vybráno více Podaktivit, které ale nejsou v buňce G11 zaškrtnuté\",\"\"))","v":""}]
[null,"DPH uznatelnost:"]
[null,null,null,null,null,null," "]
[null,"Souhrnný rozpočet"]
[null,null,null,"Náklady bez DPH","DPH [%]","Náklady s DPH","Nezpůsobilá část z celkových nákladů stanovená žadatelem (bez DPH)","Nezpůsobilá část celkem","Způsobilé náklady po zohlednění limitů způsobilých nákladů a způsobilosti DPH","INTERNÍ: Pozor na správný výpočet CZPRV při přepisu názvů položek realizace"]
[null,"Realizace","Stavební náklady",0,21,{"$f":"D16*(1+(E16/100))","v":0},0,{"$f":"CHOOSE('KR zdroj'!$P$26,G16*(1+('1) Kumulativní rozpočet'!E16/100)),D16*(E16/100)+G16,G16*(1+('1) Kumulativní rozpočet'!E16/100)),\"vyber uznatelnost DPH\")","v":"vyber uznatelnost DPH"},{"$f":"IFERROR(F16-H16,\"zadej výdaje/uznatelnost DPH\")","v":"zadej výdaje/uznatelnost DPH"}]
[null,null,"Rezerva",0,21,{"$f":"D17*(1+(E17/100))","v":0},0,{"$f":"CHOOSE('KR zdroj'!$P$26,G17*(1+('1) Kumulativní rozpočet'!E17/100)),D17*(E17/100)+G17,G17*(1+('1) Kumulativní rozpočet'!E17/100)),\"vyber uznatelnost DPH\")","v":"vyber uznatelnost DPH"},0]
[null,null,"Nákup pozemku",0,21,0,0,{"$f":"CHOOSE('KR zdroj'!$P$26,G18*(1+('1) Kumulativní rozpočet'!E18/100)),D18*(E18/100)+G18,G18*(1+('1) Kumulativní rozpočet'!E18/100)),\"vyber uznatelnost DPH\")","v":"vyber uznatelnost DPH"},{"$f":"IFERROR(F18-H18,\"zadej výdaje/uznatelnost DPH\")","v":"zadej výdaje/uznatelnost DPH"}]
[null,null,"vývoj/koncepce vzdělávacích programů pro poskytování klimatického vzdělávání",0,21,0,0,{"$f":"CHOOSE('KR zdroj'!$P$26,G19*(1+('1) Kumulativní rozpočet'!E19/100)),D19*(E19/100)+G19,G19*(1+('1) Kumulativní rozpočet'!E19/100)),\"vyber uznatelnost DPH\")","v":"vyber uznatelnost DPH"},"zadej výdaje/uznatelnost DPH"]
[null,null,"Celkem",{"$f":"SUM(D16:D19)","v":0},null,{"$f":"SUM(F16:F19)","v":0},null,{"$f":"SUM(H16:H19)","v":0},{"$f":"IFERROR(I16+I17+I18+I19,\"zadej výdaje/uznatelnost DPH\")","v":"zadej výdaje/uznatelnost DPH"}," = Celk. zp. náklady (realizace)"]
{"$rows_left_out":48}
{"sheet":"KR zdroj","index":1,"n_rows":83,"n_cols":20,"rows_kept":83,"cut":false,"hidden":true,"merged":[]}
[{"$f":"OR(C10=2,C10=3,C10=5,C10=6,C10=11)","v":false},null,1,"Vyber Specifický cíl",null,null,null,null,null,null,null,{"$f":"CHOOSE($C$1,1,0,0,0,0,0,0)","v":1},"Vyber nejprve Specifický cíl a poté hlavní Opatření projektu","1_1",null,null,null,"paušál PP"]
[{"$f":"AND(A1=TRUE,C1=6)","v":false},null,2,"1.1 Podpora energetické účinnosti a snižování emisí skleníkových plynů",null,null,null,null,null,null,null,1,"1.1.1 Snížení energetické náročnosti veřejných budov a veřejné infrastruktury","2_1",{"$f":"IF(OR(AND(P2>5,P2<15),P2=16,P2=17,P2=20),1,0)","v":0},1,"mimo Veřejnou podporu",1]
[null,null,null,"1.2 Podpora energie z obnovitelných zdrojů v souladu se směrnicí (EU) 2018/2001, včetně kritérií udržitelnosti stanovených v uvedené směrnici",null,null,null,null,null,null,null,2,"1.1.2 Snížení energetické náročnosti/zvýšení účinnosti technologických procesů","2_2",null,null,"de minimis 360/2012 ",2,null," "]
[null,null,null,"1.3 Podpora přizpůsobení se změně klimatu, prevence rizika katastrof a odolnosti vůči nim s přihlédnutím k ekosystémovým přístupům",null,null,null,null,null,null,null,3,"1.1.3 Zlepšení kvality vnitřního prostředí veřejných budov","2_3",null,null,"de minimis 1407/2013 ",3,null," "]
[null,null,null,"1.4 Podpora přístupu k vodě a udržitelného hospodaření s vodou",null,null,null,null,null,null,null,4,"1.1.4 Zvýšení adaptability veřejných budov na změnu klimatu","2_4",null,null,"de minimis 1408/2013 ",4,null," "]
[null,null,null,"1.5 Podpora přechodu na oběhové hospodářství účinně využívající zdroje",null,null,null,null,null,null,null,5,"1.1.5 Výstavba nových veřejných budov, které budou splňovat parametry pro pasivní nebo plusové budovy","2_5",null,null,"de minimis 717/2014 ",5,null," "]
[null,null,null,"1.6 Posilování ochrany a zachování přírody, biologické rozmanitosti a zelené infrastruktury, a to i v městských oblastech, a snižování všech forem znečištění",null,null,null,null,null,null,null,6,"1.2.1 Výstavba a rekonstrukce obnovitelných zdrojů energie pro veřejné budovy","3_1",null,null,"GBER článek 14",null,null," "]
[null,null,null,null,null,null,null,null,null,null,null,7,"1.2.2 Výstavba a rekonstrukce obnovitelných zdrojů energie pro zajištění dodávek systémové energie ve veřejném sektoru","3_2",null,null,"GBER ŽP článek 36"]
[null,null,null,null,null,null,null,null,null,null,null,8,"1.2.3 Výměna nevyhovujících spalovacích zdrojů na tuhá paliva a pořizování domovních předávacích stanic","3_3",null,null,"GBER ŽP článek 38"]
[null,null,4,{"$f":"CHOOSE($C$1,$M$1,M2,M7,M10,M20,M25,M36)","v":"Vyber nejprve Specifický cíl a poté hlavní Opatření projektu"},null,null,null,null,null,null,null,9,"1.3.1 Podpora přírodě blízkých opatření v krajině a sídlech","4_1",null,null,"GBER ŽP článek 40"]
[null,null,null,{"$f":"CHOOSE($C$1,$M$1,M3,M8,M11,M21,M26,M37)","v":"Vyber nejprve Specifický cíl a poté hlavní Opatření projektu"},null,null,null,null,null,null,null,10,"1.3.2 Zpracování studií a plánů (studie systémů sídelní zeleně, územní studie krajiny, plán územního systému ekologické stability)","4_2",null,null,"GBER ŽP článek 41",null,null," "]
[null,null,null,{"$f":"CHOOSE($C$1,$M$1,M4,M9,M12,M22,M27,M38)","v":"Vyber nejprve Specifický cíl a poté hlavní Opatření projektu"},null,null,null,null,null,null,null,11,"1.3.3 Realizace protipovodňových opatření","4_3",null,null,"GBER ŽP článek 45",null,null," "]
[null,null,null,{"$f":"CHOOSE($C$1,$M$1,M5,\"irelevantní\",M13,M23,M28,M39)","v":"Vyber nejprve Specifický cíl a poté hlavní Opatření projektu"},null,null,null,null,null,null,null,12,"1.3.4 Realizace opatření ke zpomalení odtoku, pro vsak, retenci a akumulaci srážkové vody vč. jejího dalšího využití; realizace zelených střech; opatření na využití šedé vody; opatření pro řízenou dotaci podzemních vod","4_4",null,null,"GBER ŽP článek 46"]
[null,null,null,{"$f":"CHOOSE($C$1,$M$1,M6,\"irelevantní\",M14,M24,M29,M40)","v":"Vyber nejprve Specifický cíl a poté hlavní Opatření projektu"},null,null,null,null,null,null,null,13,"1.3.5 Podpora preventivních opatření proti povodním a suchu, zejména budování, rozšíření, zkvalitnění a obnova monitorovacích, předpovědních, hlásných, výstražných a varovných systémů; zpracování digitálních povodňových plánů, zpracování analýzy odtokových poměrů ","4_5",null,null,"GBER ŽP článek 47"]
[null,null,null,{"$f":"CHOOSE($C$1,$M$1,\"irelevantní\",\"irelevantní\",M15,\"irelevantní\",M30,M41)","v":"Vyber nejprve Specifický cíl a poté hlavní Opatření projektu"},null,null,null,null,"kurz euro Kč",null,null,14,"1.3.6 Podpora povodňové operativy, zvyšování povědomí obyvatel o povodňovém riziku, zvyšování resilience citlivých objektů před povodněmi","4_6",null,null,"GBER ŽP článek 49"]
[null,null,null,{"$f":"CHOOSE($C$1,$M$1,\"irelevantní\",\"irelevantní\",M16,\"irelevantní\",M31,M42)","v":"Vyber nejprve Specifický cíl a poté hlavní Opatření projektu"},null,null,null,null,24.739000000000001,null,null,15,"1.3.7 Monitoring a rebilance dlouhodobě využitelných zdrojů podzemních vod pro obce v krystaliniku Českého masivu","4_7",null,null,"GBER článek 53, kulturní infrastruktura ",15]
[null,null,null,{"$f":"CHOOSE($C$1,$M$1,\"irelevantní\",\"irelevantní\",M17,\"irelevantní\",M32,M43)","v":"Vyber nejprve Specifický cíl a poté hlavní Opatření projektu"},null,null,null,null,"https://ec.europa.eu/info/funding-tenders/procedures-guidelines-tenders/information-contractors-and-beneficiaries/exchange-rate-inforeuro_cs",null,null,16,"1.3.8 Obnova stability svahů, stabilizace a sanace extrémních svahových nestabilit vzniklých v důsledku přírodních jevů","4_8",null,null,"GBER článek 55, sportovní infrastruktura"]
[null,null,null,{"$f":"CHOOSE($C$1,$M$1,\"irelevantní\",\"irelevantní\",M18,\"irelevantní\",M33,\"irelevantní\")","v":"Vyber nejprve Specifický cíl a poté hlavní Opatření projektu"},null,null,null,null,null,null,null,17,"1.3.9 Investice do modernizace vzdělávacích environmentálních center zaměřených na změnu klimatu","4_9",null,null,"GBER článek 56, lokální infrastruktura"]
[null,null,null,{"$f":"CHOOSE($C$1,$M$1,\"irelevantní\",\"irelevantní\",M19,\"irelevantní\",M34,\"irelevantní\")","v":"Vyber nejprve Specifický cíl a poté hlavní Opatření projektu"},null,null,null,null,null,null,null,18,"1.3.10 Prevence a řízení antropogenních rizik","4_10",null,null,"SGEI Rozhodnutí Komise ",18]
[null,null,null,{"$f":"CHOOSE($C$1,$M$1,\"irelevantní\",\"irelevantní\",\"irelevantní\",\"irelevantní\",M35,\"irelevantní\")","v":"Vyber nejprve Specifický cíl a poté hlavní Opatření projektu"},null,null,null,null,null,null,null,19,"1.4.1 Výstavba čistíren odpadních vod; dobudování a výstavba kanalizaci ","5_1",null,null,"SGEI Nařízení Evropského parlamentu a Rady (ES) č. 1370/2007 – Doprava ",19]
{"$rows_left_out":64}
{"sheet":"KR výstup","index":2,"n_rows":36,"n_cols":4,"rows_kept":36,"cut":false,"hidden":true,"merged":[]}
[]
[]
[null,null,"Název žadatele:",{"$f":"[1]KR!C5","v":0}]
[null,null,"Název projektu:",{"$f":"[1]KR!C6","v":0}]
[null,null,"Specifický cíl:",{"$f":"CHOOSE([1]zdroj!C1,[1]zdroj!D1,[1]zdroj!D2,[1]zdroj!D3,[1]zdroj!D4,[1]zdroj!D5,[1]zdroj!D6,[1]zdroj!D7)","v":"Vyber Specifický cíl"}]
[null,null,"Veřejná podpora:",{"$f":"CHOOSE([1]zdroj!P2,[1]zdroj!Q2,[1]zdroj!Q3,[1]zdroj!Q4,[1]zdroj!Q5,[1]zdroj!Q6,[1]zdroj!Q7,[1]zdroj!Q8,[1]zdroj!Q9,[1]zdroj!Q10,[1]zdroj!Q11,[1]zdroj!Q12,[1]zdroj!Q13,[1]zdroj!Q14,[1]zdroj!Q15,[1]zdroj!Q16,[1]zdroj!Q17,[1]zdroj!Q18,[1]zdroj!Q19,[1]zdroj!Q20,[1]zdroj!Q21)","v":"mimo Veřejnou podporu"}]
[null,null,"DPH uznatelnost:",{"$f":"CHOOSE([1]zdroj!P26,[1]zdroj!Q26,[1]zdroj!Q27,[1]zdroj!Q28,[1]zdroj!Q29)","v":"Vyber"}]
[null,null,"Velikost podniku:",{"$f":"CHOOSE([1]zdroj!P35,[1]zdroj!Q35,[1]zdroj!Q36,[1]zdroj!Q37,[1]zdroj!Q38)","v":"irelevantní"}]
[null,null,"Celkové náklady projektu",{"$f":"[1]KR!$D$29","v":"zadej výdaje/DPH"}]
[null,null,"Celkové způsobilé výdaje projeku",{"$f":"[1]KR!D30","v":"zadej výdaje/DPH"}]
[null,null,"Celkové nezpůsobilé výdaje projetku",{"$f":"[1]KR!D31","v":"zadej výdaje/DPH"}]
[null,null,"Opatření specifického cíle (hlavní)",{"$f":"[1]KR!C51","v":"Vyber nejprve Specifický cíl a poté hlavní Opatření projektu"}]
[null,null,"Opatření #2",{"$f":"[1]KR!C52","v":"vyber Opatření #2"}]
[null,null,"Opatření #3",{"$f":"[1]KR!C53","v":"vyber Opatření #3"}]
[null,null,"Opatření #4",{"$f":"[1]KR!C54","v":"vyber Opatření #4"}]
[null,null,"Opatření #5",{"$f":"[1]KR!C55","v":"vyber Opatření #5"}]
[null,null,"Opatření #6",{"$f":"[1]KR!C56","v":"vyber Opatření #6"}]
[null,null,"Opatření #7",{"$f":"[1]KR!C57","v":"vyber Opatření #7"}]
[null,null,"Opatření #8",{"$f":"[1]KR!C58","v":"vyber Opatření #8"}]
[null,null,"Opatření #9",{"$f":"[1]KR!C59","v":"vyber Opatření #9"}]
{"$rows_left_out":17}
{"sheet":"2) Stanovení jednotkové podpory","index":3,"n_rows":129,"n_cols":13,"rows_kept":129,"cut":false,"hidden":false,"merged":[[0,2,1,5],[23,3,23,5],[48,4,48,5],[95,1,95,3],[103,1,104,1],[94,4,94,5],[63,4,63,5],[75,4,75,5],[76,1,76,3],[51,1,53,1],[84,1,85,1],[113,4,113,5],[118,3,118,5],[2,2,2,4],[3,2,3,4],[24,0,24,1],[54,2,56,2],[57,2,59,2],[70,2,71,2],[28,1,29,1],[30,1,31,1],[34,1,35,1],[36,1,39,1],[70,1,71,1],[54,1,59,1],[116,3,116,5]]}
["Identifikace projektu",null,"Poznámka k vyplnění: Tabulka je optimalizována pro MS Excel 2010 a vyšší. Použití starší verze či jiného programu může způsobit problémy. Editujte pouze zelené buňky a zaškrtávací políčka, vybírejte z rozbalovacích menu. Řiďte se informacemi označenými červeným trojúhelníkem v pravém horním rohu buněk."]
[]
[null,"Název žadatele",{"$f":"'1) Kumulativní rozpočet'!C5:F5","v":0}]
[null,"Název projektu",{"$f":"'1) Kumulativní rozpočet'!C6:F6","v":0}]
[null,"Číslo výzvy",11]
[null,"Hodnota koeficientu k2",1.1000000000000001]
[null,"Památkově chráněná budova","NE"]
[null,"Budova sloužící pro výchovu a vzdělávání dětí a mladistvých","NE"]
[null,"DPH je v rámci projektu způsobilým výdajem",{"$f":"IF('KR zdroj'!$P$26=4,\"Nezvoleno na 1. listu\",IF('KR zdroj'!$P$26=2,\"NE\",\"ANO\"))","v":"Nezvoleno na 1. listu"}]
[null,"Stanovte příslušnou procentní výši DPH pro realizaci",{"$f":"'1) Kumulativní rozpočet'!E16/100","v":0.21}]
["Obecné parametry - stanovení míry kvality renovace"]
[null,null,null,null,"hodnota","jednotka"]
[null,"Spotřeba primární energie z neobnovitelných zdrojů - stav před realizací navržených opatření",null,null,null,"kWh/rok"]
[null,"Spotřeba primární energie z neobnovitelných zdrojů - stav po realizaci navržených opatření",null,null,null,"kWh/rok"]
[null,"Spotřeba primární energie z neobnovitelných zdrojů dle PENB pro referenční budovu - stav po realizaci navržených opatření",null,null,null,"kWh/rok"]
[null,"Průměrný součinitel prostupu tepla obálky budovy - stav po realizaci navržených opatření",null,null,null,"W.m-2.K-1"]
[null,"Požadovaný součinitel prostupu tepla obálky referenční budovy - stav po realizaci navržených opatření",null,null,null,"W.m-2.K-1"]
[null,"Nejvyšší podíl hodnoty součinitele prostupu tepla měněných stavebních prvků vyjma oken, na něž se vztahuje podpora, vůči příslušné požadované hodnotě součinitele prostupu tepla pro danou konstrukci",null,null,null,"%"]
[null,"Nejvyšší podíl hodnoty součinitele prostupu tepla měněných oken, na něž se vztahuje podpora, vůči příslušné požadované hodnotě součinitele prostupu tepla pro danou konstrukci",null,null,null,"%"]
[null,"Nejvyšší dosažená denní teplota vzduchu v referenční místnosti v letním období po realizaci navržených opatření",null,null,null,"°C"]
{"$rows_left_out":110}
{"sheet":"SJP Pomocné hodnoty","index":4,"n_rows":117,"n_cols":21,"rows_kept":117,"cut":false,"hidden":true,"merged":[[99,1,101,1],[102,1,104,1],[96,0,98,0],[86,0,87,0],[17,0,18,0],[19,0,20,0],[23,0,24,0],[25,0,28,0],[90,0,91,0],[99,0,104,0]]}
["A",null,null,null,null,null,"Číselník pro obecné parametry"]
["Úspora primární energie z neobnovitelných zdrojů",null,0.3,0.4,null,null,1,"Nepam",null,{"$f":"IF('2) Stanovení jednotkové podpory'!$C$7=\"NE\",IF('2) Stanovení jednotkové podpory'!$C$8=\"NE\",IF(AND('2) Stanovení jednotkové podpory'!D46=FALSE,'2) Stanovení jednotkové podpory'!D92=FALSE,'2) Stanovení jednotkové podpory'!D112=FALSE),1,3),IF(AND('2) Stanovení jednotkové podpory'!D46=FALSE,'2) Stanovení jednotkové podpory'!D92=FALSE,'2) Stanovení jednotkové podpory'!D112=FALSE),2,4)),IF('2) Stanovení jednotkové podpory'!$C$8=\"NE\",IF(AND('2) Stanovení jednotkové podpory'!D46=FALSE,VD92=FALSE,'2) Stanovení jednotkové podpory'!D112=FALSE),5,7),IF(AND('2) Stanovení jednotkové podpory'!D46=FALSE,'2) Stanovení jednotkové podpory'!D92=FALSE,'2) Stanovení jednotkové podpory'!D112=FALSE),6,8)))","v":1}]
["Dosažená hodnota primární energie z neobnovitelných zdrojů dle PENB pro stav po realizaci navržených opatření",null,0.85,0.7,null,null,2,"Nepam škola"]
["Průměrný součinitel prostupu tepla obálky budovy",null,0.95,0.8,null,null,3,"Nepam EPC"]
["Součinitel prostupu tepla pro měněné stavební prvky vyjma oken, na něž se vztahuje podpora",null,null,null,null,null,4,"Nepam škola EPC"]
["Součinitel prostupu tepla oken, na něž se vztahuje podpora",null,0.15,null,null,null,5,"Pam"]
["Nejvyšší denní teplota vzduchu v místnosti v letním období ",null,0.21,null,null,null,6,"Pam škola "]
["Koncept větrání",null,null,null,null,null,7,"Pam EPC"]
[null,null,"ANO",null,null,null,8,"Pam škola EPC"]
[null,null,"NE"]
[{"$f":"IF('2) Stanovení jednotkové podpory'!$A$26=TRUE,1,0)+IF('2) Stanovení jednotkové podpory'!$A$50=TRUE,1,0)+IF('2) Stanovení jednotkové podpory'!$A$65=TRUE,1,0)+IF('2) Stanovení jednotkové podpory'!$A$77=TRUE,1,0)","v":0},"počet specifických cílů dotčených projektem"]
[null,"Specifický cíl 1.2 (po zatržení je nutno vybrat jedno z opatření v rozbalovacím menu u této buňky vpravo)"]
[null,"1.2.1 Výstavba a rekonstrukce obnovitelných zdrojů energie pro veřejné budovy"]
[null,"1.2.2 Výstavba a rekonstrukce obnovitelných zdrojů energie pro zajištění dodávek systémové energie ve veřejném sektoru"]
[]
[null,null,null,null,null,"jednotkové náklady bez DPH","k1",null,"% podpory pro oblast A a C",null,null,40,"% podpory pro oblast B",null,null,60,null,"k2","k3 A1","k3 A2","k4"]
["Plocha zateplovaných obvodových stěn",null,null,null,null,4200,1,0.05,"+0,05 – v případě certifikátu EPD pro tepelný izolant (environmentální prohlášení typu III)",null,null,null,null,null,null,null,null,{"$f":"'2) Stanovení jednotkové podpory'!C6","v":1.1000000000000001},0.5,{"$f":"S17+0.15","v":0.65},1.1000000000000001]
["Plocha měněných otvorových výplní (oken a dveří)","ne LOP",null,null,null,8900,1,0.05,"+0,05 – v případě certifikátu EPD pro tepelný izolant (environmentální prohlášení typu III)",null,null,null,null,null,null,null,null,{"$f":"$R$17","v":1.1000000000000001},0.5,{"$f":"S18+0.15","v":0.65},{"$f":"$U$17","v":1.1000000000000001}]
[null,"LOP",null,null,null,8900,1.3,0.05,"+0,05 – v případě certifikátu EPD pro tepelný izolant (environmentální prohlášení typu III)",null,null,null,null,null,null,null,null,{"$f":"$R$17","v":1.1000000000000001},0.5,0.65,{"$f":"$U$17","v":1.1000000000000001}]
["Plocha zateplovaných plochých či šikmých střech","nová skladba včetně paro a hydro izolace",null,null,null,3200,1,0.05,"+0,05 – v případě certifikátu EPD pro tepelný izolant (environmentální prohlášení typu III)",null,null,null,null,null,null,null,null,1.1000000000000001,0.5,0.65,1.1000000000000001]
{"$rows_left_out":98}
{"sheet":"3) Výsledný rozpočet do ISKP21+","index":5,"n_rows":53,"n_cols":13,"rows_kept":53,"cut":false,"hidden":false,"merged":[[19,4,19,5],[21,4,21,5],[18,4,18,5],[23,4,23,5],[18,8,18,9],[19,8,19,9],[21,8,21,9],[23,8,23,9],[18,6,18,7],[19,6,19,7],[21,6,21,7],[23,6,23,7],[23,0,23,3],[34,9,34,10],[35,9,35,10],[36,9,36,10],[28,0,28,2],[28,7,28,8],[25,7,27,11]]}
["Veřejná podpora"]
[]
["Typ veřejné podpory"]
[1]
[]
["Stanovení výše podpory pro veřejnou podporu dle GBER",null,null,null,null,null,null,null,"Stanovení výše podpory pro De minimis"]
[]
["Bonifikace za umístění projektu",null,null,null,null,null,null,null,"Předchozí čerpání de minimis v €"]
[2,null,null,null,null,null,null,null,"Aktuální kurz €",null,null,null,"https://commission.europa.eu/funding-tenders/procedures-guidelines-tenders/information-contractors-and-beneficiaries/exchange-rate-inforeuro_cs"]
[null,null,null,null,null,null,null,null,"Limit pro čerpání v Kč",null,null,{"$f":"IF(A4=2,(200000-L8)*L9,IF(A4=3,(500000-L8)*L9,\"\"))","v":""}]
["Bonifikace za velikost podniku"]
[3]
[]
[null,null,null,null,false]
[]
[]
["Porovnání celkové podpory projektu dle pravidel OPŽP 21+ a pravidel veřejné podpory"]
[]
[null,null,null,null,"Realizace",null,"PP+AD+TDI",null,"Celkem"]
["Dle pravidel výzvy",null,null,null,{"$f":"IF('1) Kumulativní rozpočet'!D16=0,0,MIN('1) Kumulativní rozpočet'!I20,'2) Stanovení jednotkové podpory'!D119))","v":0},null,{"$f":"IF('1) Kumulativní rozpočet'!D16=0,0,MIN(1,('2) Stanovení jednotkové podpory'!D119/MIN('2) Stanovení jednotkové podpory'!D117,'1) Kumulativní rozpočet'!I20)))*MIN((IF(MIN('2) Stanovení jednotkové podpory'!D117,'1) Kumulativní rozpočet'!I20)>10000000,0.035,IF(MIN('2) Stanovení jednotkové podpory'!D117,'1) Kumulativní rozpočet'!I20)>3000000,0.05,0.07))*MIN('2) Stanovení jednotkové podpory'!D117,'1) Kumulativní rozpočet'!I20)),15000000))","v":0},null,{"$f":"SUM(E20:G20)","v":0}]
{"$rows_left_out":34}
{"sheet":"VP pomocné hodnoty","index":6,"n_rows":42,"n_cols":8,"rows_kept":42,"cut":false,"hidden":true,"merged":[[21,3,22,3],[21,4,22,4],[21,5,22,5],[21,6,22,6],[24,6,26,6],[36,1,36,2],[37,1,37,2],[38,1,38,2],[19,1,19,2],[20,1,20,2],[21,1,22,2],[23,1,23,2],[27,6,29,6],[33,1,35,1],[30,1,32,1],[27,1,29,1],[24,1,26,1],[30,6,32,6],[33,6,35,6]]}
[1,"mimo rámec veřejné podpory"]
[2,"De minimis 1407/2013"]
[3,"De minimis 360/2012 (SOHZ)"]
[4,"Rozhodnutí SOHZ"]
[5,"GBER (článek 38) Investiční podpora na opatření ke zvýšení energetické účinnosti "]
[6,"GBER (článek 40) Investiční podpora na vysokoúčinnou kombinovanou výrobu tepla a elektrické energie"]
[7,"GBER (článek 41) Investiční podpora energie z obnovitelných zdrojů"]
[8,"GBER (článek 53) Podpora kultury a zachování kulturního dědictví "]
[9,"GBER (článek 55) Podpora na sportovní a multifunkční rekreační infrastrukturu"]
[10,"GBER (článek 56) Investiční podpora na místní infrastrukturu"]
[]
[1,"Malý podnik"]
[2,"Střední podnik"]
[3,"Velký podnik a ostatní"]
[]
[1,"Praha (bez bonifikace)"]
[2,"regiony dle čl. 107 odst. 3 písm. a) Smlouvy o fungování EU"]
[3,"regiony dle čl. 107 odst. 3 písm. c) Smlouvy o fungování EU"]
[]
[null,"Předpis/článek",null,"Max VP v Praze","Max VP pro regiony dle čl. 107 odst. 3 písm. a) Smlouvy o fungování EU[1]","Max VP pro regiony dle čl. 107 odst. 3 písm.  c) Smlouvy o fungování EU [2]","Notifikační práh "]
{"$rows_left_out":22}